[prev in list] [next in list] [prev in thread] [next in thread] 

List:       qemu-block
Subject:    Re: [PATCH v3 00/17] 64bit block-layer
From:       no-reply () patchew ! org
Date:       2020-04-30 20:57:17
Message-ID: 158828023475.4471.5567824533045401360 () 45ef0f9c86ae
[Download RAW message or body]

Patchew URL: https://patchew.org/QEMU/20200430111033.29980-1-vsementsov@virtuozzo.com/




Hi,

This series failed the asan build test. Please find the testing commands and
their output below. If you have Docker installed, you can probably reproduce it
locally.

=== TEST SCRIPT BEGIN ===
#!/bin/bash
export ARCH=x86_64
make docker-image-fedora V=1 NETWORK=1
time make docker-test-debug@fedora TARGET_LIST=x86_64-softmmu J=14 NETWORK=1
=== TEST SCRIPT END ===

clang -iquote /tmp/qemu-test/build/tests -iquote tests -iquote \
/tmp/qemu-test/src/tcg/i386 -isystem /tmp/qemu-test/src/linux-headers -isystem \
/tmp/qemu-test/build/linux-headers -iquote . -iquote /tmp/qemu-test/src -iquote \
/tmp/qemu-test/src/accel/tcg -iquote /tmp/qemu-test/src/include -iquote \
/tmp/qemu-test/src/disas/libvixl -I/usr/include/pixman-1   -Werror \
-fsanitize=undefined -fsanitize=address  -pthread -I/usr/include/glib-2.0 \
-I/usr/lib64/glib-2.0/include  -fPIE -DPIE -m64 -mcx16 -D_GNU_SOURCE \
-D_FILE_OFFSET_BITS=64 -D_LARGEFILE_SOURCE -Wstrict-prototypes -Wredundant-decls \
-Wall -Wundef -Wwrite-strings -Wmissing-prototypes -fno-strict-aliasing -fno-common \
-fwrapv -std=gnu99  -Wno-string-plus-int -Wno-typedef-redefinition \
-Wno-initializer-overrides -Wexpansion-to-defined -Wendif-labels \
-Wno-shift-negative-value -Wno-missing-include-dirs -Wempty-body -Wnested-externs \
-Wformat-security -Wformat-y2k -Winit-self -Wignored-qualifiers \
-Wold-style-definition -Wtype-limits -fstack-protector-strong   \
-I/usr/include/p11-kit-1   -DLEGACY_RDMA_REG_MR -DSTRUCT_IOVEC_DEFINED  \
-I/usr/include/libpng16  -I/usr/include/spice-1 -I/usr/include/spice-server \
-I/usr/include/cacard -I/usr/include/glib-2.0 -I/usr/lib64/glib-2.0/include \
-I/usr/include/nss3 -I/usr/include/nspr4 -pthread -I/usr/include/libmount \
-I/usr/include/blkid -I/usr/include/uuid -I/usr/include/pixman-1   \
-I/tmp/qemu-test/src/tests -I/tmp/qemu-test/src/tests/qtest -MMD -MP -MT \
tests/test-crypto-secret.o -MF tests/test-crypto-secret.d -g   -c -o \
tests/test-crypto-secret.o /tmp/qemu-test/src/tests/test-crypto-secret.c clang \
-iquote /tmp/qemu-test/build/tests -iquote tests -iquote /tmp/qemu-test/src/tcg/i386 \
-isystem /tmp/qemu-test/src/linux-headers -isystem /tmp/qemu-test/build/linux-headers \
-iquote . -iquote /tmp/qemu-test/src -iquote /tmp/qemu-test/src/accel/tcg -iquote \
/tmp/qemu-test/src/include -iquote /tmp/qemu-test/src/disas/libvixl \
-I/usr/include/pixman-1   -Werror -fsanitize=undefined -fsanitize=address  -pthread \
-I/usr/include/glib-2.0 -I/usr/lib64/glib-2.0/include  -fPIE -DPIE -m64 -mcx16 \
-D_GNU_SOURCE -D_FILE_OFFSET_BITS=64 -D_LARGEFILE_SOURCE -Wstrict-prototypes \
-Wredundant-decls -Wall -Wundef -Wwrite-strings -Wmissing-prototypes \
-fno-strict-aliasing -fno-common -fwrapv -std=gnu99  -Wno-string-plus-int \
-Wno-typedef-redefinition -Wno-initializer-overrides -Wexpansion-to-defined \
-Wendif-labels -Wno-shift-negative-value -Wno-missing-include-dirs -Wempty-body \
-Wnested-externs -Wformat-security -Wformat-y2k -Winit-self -Wignored-qualifiers \
-Wold-style-definition -Wtype-limits -fstack-protector-strong   \
-I/usr/include/p11-kit-1   -DLEGACY_RDMA_REG_MR -DSTRUCT_IOVEC_DEFINED  \
-I/usr/include/libpng16  -I/usr/include/spice-1 -I/usr/include/spice-server \
-I/usr/include/cacard -I/usr/include/glib-2.0 -I/usr/lib64/glib-2.0/include \
-I/usr/include/nss3 -I/usr/include/nspr4 -pthread -I/usr/include/libmount \
-I/usr/include/blkid -I/usr/include/uuid -I/usr/include/pixman-1   \
-I/tmp/qemu-test/src/tests -I/tmp/qemu-test/src/tests/qtest -MMD -MP -MT \
tests/test-crypto-tlscredsx509.o -MF tests/test-crypto-tlscredsx509.d -g   -c -o \
tests/test-crypto-tlscredsx509.o /tmp/qemu-test/src/tests/test-crypto-tlscredsx509.c \
clang -iquote /tmp/qemu-test/build/tests -iquote tests -iquote \
/tmp/qemu-test/src/tcg/i386 -isystem /tmp/qemu-test/src/linux-headers -isystem \
/tmp/qemu-test/build/linux-headers -iquote . -iquote /tmp/qemu-test/src -iquote \
/tmp/qemu-test/src/accel/tcg -iquote /tmp/qemu-test/src/include -iquote \
/tmp/qemu-test/src/disas/libvixl -I/usr/include/pixman-1   -Werror \
-fsanitize=undefined -fsanitize=address  -pthread -I/usr/include/glib-2.0 \
-I/usr/lib64/glib-2.0/include  -fPIE -DPIE -m64 -mcx16 -D_GNU_SOURCE \
-D_FILE_OFFSET_BITS=64 -D_LARGEFILE_SOURCE -Wstrict-prototypes -Wredundant-decls \
-Wall -Wundef -Wwrite-strings -Wmissing-prototypes -fno-strict-aliasing -fno-common \
-fwrapv -std=gnu99  -Wno-string-plus-int -Wno-typedef-redefinition \
-Wno-initializer-overrides -Wexpansion-to-defined -Wendif-labels \
-Wno-shift-negative-value -Wno-missing-include-dirs -Wempty-body -Wnested-externs \
-Wformat-security -Wformat-y2k -Winit-self -Wignored-qualifiers \
-Wold-style-definition -Wtype-limits -fstack-protector-strong   \
-I/usr/include/p11-kit-1   -DLEGACY_RDMA_REG_MR -DSTRUCT_IOVEC_DEFINED  \
-I/usr/include/libpng16  -I/usr/include/spice-1 -I/usr/include/spice-server \
-I/usr/include/cacard -I/usr/include/glib-2.0 -I/usr/lib64/glib-2.0/include \
-I/usr/include/nss3 -I/usr/include/nspr4 -pthread -I/usr/include/libmount \
-I/usr/include/blkid -I/usr/include/uuid -I/usr/include/pixman-1   \
-I/tmp/qemu-test/src/tests -I/tmp/qemu-test/src/tests/qtest -MMD -MP -MT \
tests/crypto-tls-x509-helpers.o -MF tests/crypto-tls-x509-helpers.d -g   -c -o \
                tests/crypto-tls-x509-helpers.o \
                /tmp/qemu-test/src/tests/crypto-tls-x509-helpers.c
/tmp/qemu-test/src/tests/test-block-iothread.c:79:31: error: incompatible pointer \
types initializing 'int (*)(BlockDriverState *, int64_t, int64_t)' (aka 'int \
(*)(struct BlockDriverState *, long, long)') with an expression of type 'int \
(BlockDriverState *, int64_t, int)' (aka 'int (struct BlockDriverState *, long, \
                int)') [-Werror,-Wincompatible-pointer-types]
    .bdrv_co_pdiscard       = bdrv_test_co_pdiscard,
                              ^~~~~~~~~~~~~~~~~~~~~
1 error generated.
make: *** [/tmp/qemu-test/src/rules.mak:69: tests/test-block-iothread.o] Error 1
make: *** Waiting for unfinished jobs....
Traceback (most recent call last):
  File "./tests/docker/docker.py", line 664, in <module>
---
    raise CalledProcessError(retcode, cmd)
subprocess.CalledProcessError: Command '['sudo', '-n', 'docker', 'run', '--label', \
'com.qemu.instance.uuid=e0743bd266804107bb9089aec26150f7', '-u', '1001', \
'--security-opt', 'seccomp=unconfined', '--rm', '-e', 'TARGET_LIST=x86_64-softmmu', \
'-e', 'EXTRA_CONFIGURE_OPTS=', '-e', 'V=', '-e', 'J=14', '-e', 'DEBUG=', '-e', \
'SHOW_ENV=', '-e', 'CCACHE_DIR=/var/tmp/ccache', '-v', \
'/home/patchew/.cache/qemu-docker-ccache:/var/tmp/ccache:z', '-v', \
'/var/tmp/patchew-tester-tmp-39rsbv95/src/docker-src.2020-04-30-16.52.24.18470:/var/tmp/qemu:z,ro', \
'qemu:fedora', '/var/tmp/qemu/run', 'test-debug']' returned non-zero exit status 2. \
filter=--filter=label=com.qemu.instance.uuid=e0743bd266804107bb9089aec26150f7 \
make[1]: *** [docker-run] Error 1 make[1]: Leaving directory \
                `/var/tmp/patchew-tester-tmp-39rsbv95/src'
make: *** [docker-run-test-debug@fedora] Error 2

real    4m51.462s
user    0m8.644s


The full log is available at
http://patchew.org/logs/20200430111033.29980-1-vsementsov@virtuozzo.com/testing.asan/?type=message.
                
---
Email generated automatically by Patchew [https://patchew.org/].
Please send your feedback to patchew-devel@redhat.com


[prev in list] [next in list] [prev in thread] [next in thread] 

Configure | About | News | Add a list | Sponsored by KoreLogic