[prev in list] [next in list] [prev in thread] [next in thread] 

List:       postgis-users
Subject:    RE: [postgis-users] Compile Problem with postgis
From:       "Mark Cave-Ayland" <m.cave-ayland () webbased ! co ! uk>
Date:       2004-08-26 14:02:59
Message-ID: 8F4A22E017460A458DB7BBAB65CA6AE512D34F () openmanage
[Download RAW message or body]


> -----Original Message-----
> From: postgis-users-bounces@postgis.refractions.net 
> [mailto:postgis-users-bounces@postgis.refractions.net] On 
> Behalf Of Oli Young
> Sent: 26 August 2004 14:06
> To: postgis-users@postgis.refractions.net
> Subject: [postgis-users] Compile Problem with postgis
> 
> 
> Hi,
> 
> I'm trying to install postgis-0.7.5 on a Debian (sarge) box, with  
> postgresql-7.4.3 installed with apt-get.
> 
> I've followed the instructions as here --  
> http://edseek.com/archives/2004/03/31/installing-postgis-on-debian- 
> gnulinux/ -- and everything seemed okay until i've attempted 
> to 'make'  
> postgis. Output as follows
> 
> [root@mojave][/usr/src/postgresql-7.4.3/build-tree/postgresql-7.4.3/ 
> contrib/postgis-0.7.5][0]: make
> i386-linux-gcc -DCHECK_RLIMIT_NOFILE -fno-strict-aliasing -g -Wall  
> -Wmissing-prototypes -Wmissing-declarations -pipe -fPIC -g -I.  
> -I../../src/include -D_GNU_SOURCE  -I/usr/include/tcl8.4 -DFRONTEND  
> -DSYSCONFDIR='"/usr/etc/postgresql"' -DUSE_VERSION=73  -c -o  
> postgis_estimate.o postgis_estimate.c
> postgis_estimate.c: In function `get_restriction_var':
> postgis_estimate.c:543: warning: assignment from incompatible 
> pointer  
> type
> postgis_estimate.c:545: warning: assignment from incompatible 
> pointer  
> type
> postgis_estimate.c: In function `genericcostestimate2':
> postgis_estimate.c:752: error: structure has no member named `elem'
> postgis_estimate.c:752: error: too few arguments to function  
> `clauselist_selectivity'
> postgis_estimate.c:810: warning: passing arg 1 of 
> `cost_qual_eval' from  
> incompatible pointer type
> postgis_estimate.c:810: error: too few arguments to function  
> `cost_qual_eval'
> postgis_estimate.c:810: error: void value not ignored as it 
> ought to be
> make: *** [postgis_estimate.o] Error 1
> 
> Any ideas ?
> 
> Thanks in advance
> Oli


Hi Oli,

0.7.3 is quite an old release. Do you still have the same problem if you
download and install the latest 0.8.2 release?


Kind regards,

Mark.

---

Mark Cave-Ayland
Webbased Ltd.
Tamar Science Park
Derriford
Plymouth
PL6 8BX
England

Tel: +44 (0)1752 764445
Fax: +44 (0)1752 764446


This email and any attachments are confidential to the intended
recipient and may also be privileged. If you are not the intended
recipient please delete it from your system and notify the sender. You
should not copy it or use it for any purpose nor disclose or distribute
its contents to any other person.



[prev in list] [next in list] [prev in thread] [next in thread] 

Configure | About | News | Add a list | Sponsored by KoreLogic