[prev in list] [next in list] [prev in thread] [next in thread] 

List:       koffice-devel
Subject:    Re: KOffice 1.3.1 sources released
From:       Giovanni Venturi <gventuri73 () tiscali ! it>
Date:       2004-05-06 21:43:24
Message-ID: 200405062343.34589.gventuri73 () tiscali ! it
[Download RAW message or body]

-----BEGIN PGP SIGNED MESSAGE-----
Hash: SHA1

Alle 15:55, giovedì 6 maggio 2004, Nicolas Goutte ha scritto:
> So perhaps, you need to run:
> make -f Makefile.cvs
> so that the configure.in.in files are processed.
>
Sorry to disturb again.
I tryed, so then I gave 'configure', make, but I've got:
make[3]: Entering directory `/home/slacky/compiled/koffice/karbon/core'
if /bin/sh ../../libtool --silent --mode=compile --tag=CXX g++ -DHAVE_CONFIG_H 
- -I. -I. -I../.. -I../../lib/kofficeui -I../../lib/kofficeui 
- -I../../lib/kofficecore -I../../lib/kofficecore -I../../lib/store 
- -I../../lib/store -I../../lib/kwmf -I../../lib/kwmf -I../../lib/kopainter 
- -I../../lib/kopainter -I./.. -I./../render -I./../visitors 
- -I/usr/include/freetype2 -I/opt/kde3/include -I/usr/lib/qt32/include -I.   
- -DQT_THREAD_SUPPORT  -D_REENTRANT  -Wnon-virtual-dtor -Wno-long-long -Wundef 
- -Wall -W -Wpointer-arith -Wwrite-strings -ansi -D_XOPEN_SOURCE=500 
- -D_BSD_SOURCE -Wcast-align -Wconversion -Wchar-subscripts -O2 
- -Wformat-security -Wmissing-format-attribute -fno-exceptions -fno-check-new 
- -fno-common -DQT_CLEAN_NAMESPACE -DQT_NO_ASCII_CAST -DQT_NO_STL 
- -DQT_NO_COMPAT -DQT_NO_TRANSLATION  -MT vtext.lo -MD -MP -MF 
".deps/vtext.Tpo" -c -o vtext.lo vtext.cc; \
then mv -f ".deps/vtext.Tpo" ".deps/vtext.Plo"; else rm -f ".deps/vtext.Tpo"; 
exit 1; fi
vtext.cc:41:35: fontconfig/fontconfig.h: No such file or directory
vtext.cc: In member function `void VText::traceText()':
vtext.cc:431: error: `FC_SLANT_ROMAN' undeclared (first use this function)
vtext.cc:431: error: (Each undeclared identifier is reported only once for 
each
   function it appears in.)
vtext.cc:433: error: `FC_SLANT_ITALIC' undeclared (first use this function)
vtext.cc:437: error: `FC_WEIGHT_BOLD' undeclared (first use this function)
vtext.cc: In member function `QString VText::buildRequest(QString, int, int,
   double, int&)':
vtext.cc:604: error: `FcPattern' undeclared (first use this function)
vtext.cc:604: error: `pattern' undeclared (first use this function)
vtext.cc:607: error: `FC_WEIGHT' undeclared (first use this function)
vtext.cc:607: error: `FcTypeInteger' undeclared (first use this function)
vtext.cc:608: error: `FC_SLANT' undeclared (first use this function)
vtext.cc:609: error: `FC_SIZE' undeclared (first use this function)
vtext.cc:609: error: `FcTypeDouble' undeclared (first use this function)
vtext.cc:609: error: `FcPatternBuild' undeclared (first use this function)
vtext.cc:612: error: `FC_FAMILY' undeclared (first use this function)
vtext.cc:612: error: parse error before `*' token
vtext.cc:615: error: `FC_HINTING' undeclared (first use this function)
vtext.cc:615: error: `FcPatternAddBool' undeclared (first use this function)
vtext.cc:618: error: `FcDefaultSubstitute' undeclared (first use this 
function)
vtext.cc:619: error: `FcConfigGetCurrent' undeclared (first use this function)
vtext.cc:619: error: `FcMatchPattern' undeclared (first use this function)
vtext.cc:619: error: `FcConfigSubstitute' undeclared (first use this function)
vtext.cc:622: error: `FcResult' undeclared (first use this function)
vtext.cc:622: error: parse error before `;' token
vtext.cc:623: error: `match' undeclared (first use this function)
vtext.cc:623: error: `result' undeclared (first use this function)
vtext.cc:623: error: `FcFontMatch' undeclared (first use this function)
vtext.cc:626: error: `FcPatternDestroy' undeclared (first use this function)
vtext.cc:629: error: `FcChar8' undeclared (first use this function)
vtext.cc:629: error: `temp' undeclared (first use this function)
vtext.cc:633: error: `FcPatternDuplicate' undeclared (first use this function)
vtext.cc:636: error: `FC_FILE' undeclared (first use this function)
vtext.cc:636: error: `FcPatternGetString' undeclared (first use this function)
vtext.cc:636: error: `FcResultMatch' undeclared (first use this function)
vtext.cc:637: error: `FC_INDEX' undeclared (first use this function)
vtext.cc:637: error: `FcPatternGetInteger' undeclared (first use this 
function)
make[3]: *** [vtext.lo] Error 1

Well, maybe I have to delete compiled koffice dir and repeat all compiling 
process in a new clean dir?
Gianni
- -- 
A KDE Italian translator
Slackware GNU/Linux current version - kernel 2.6.6-rc3
-----BEGIN PGP SIGNATURE-----
Version: GnuPG v1.2.3 (GNU/Linux)

iD8DBQFAmrGDnT2ev4/bQKARAhUCAJ9mj13WF1etRUM42NvFlUGKvR7+9ACfXC/r
OJKJrrvpVIfHujj9G7wmy2A=
=XiyP
-----END PGP SIGNATURE-----
_______________________________________________
koffice-devel mailing list
koffice-devel@mail.kde.org
https://mail.kde.org/mailman/listinfo/koffice-devel

[prev in list] [next in list] [prev in thread] [next in thread] 

Configure | About | News | Add a list | Sponsored by KoreLogic